Traveler Accommodation
type: Class
subclass of: RCJn3atbap7QaYJjysSsJ1P
definition: This industry group comprises establishments primarily engaged in providing short-term lodging in facilities, such as hotels, motels, casino hotels, and bed-and-breakfast inns. In addition to lodging, these establishments may provide a range of other services to their guests.