Soap, Cleaning Compound, and Toilet Preparation Manufacturing
type: Class
subclass of: RBrBYbsaP35Zqr9ZrYFHMda
definition: This industry group comprises establishments primarily engaged in (1) manufacturing and packaging soaps, detergents, polishes, surface active agents, textile and leather finishing agents, and other sanitation goods or (2) preparing, blending, compounding, and packaging toilet preparations.