Distilleries
type: Class
subclass of: or0GbPZLRVCU3cGGZ5fUfA
definition: This industry comprises establishments primarily engaged in one or more of the following: (1) distilling potable liquors (except brandies); (2) distilling and blending liquors; and (3) blending and mixing liquors and other ingredients.