Indoor and Outdoor Display Advertising
type: Class
subclass of: HgO9iM63RFqZ0MnHehqJnw
definition: This industry comprises establishments primarily engaged in creating and designing public display advertising campaign materials, such as printed, painted, or electronic displays; and/or placing such displays on indoor or outdoor billboards and panels, or on or within transit vehicles or facilities, shopping malls, retail (in-store) displays, and other display structures or sites.