Other Millwork (including Flooring)
type: Class
subclass of: neEU9-WeRpKClWn2ui4HvQ
definition: This U.S. industry comprises establishments primarily engaged in manufacturing millwork (except wood windows, wood doors, and cut stock).
example: Clear and finger joint wood moldings manufacturing
example: Decorative wood moldings (e.g., base, chair rail, crown, shoe) manufacturing
example: Ornamental woodwork (e.g., cornices, mantel) manufacturing
example: Planing mills, millwork
example: Stairwork (e.g., newel posts, railings, stairs, staircases), wood, manufacturing
example: Wood flooring manufacturing
example: Wood shutters manufacturing