All Other Petroleum and Coal Products Manufacturing
type: Class
subclass of: tIcmYcXQQkyqFjsOLEbcQQ
definition: This U.S. industry comprises establishments primarily engaged in manufacturing petroleum products (except asphalt paving, roofing, and saturated materials and lubricating oils and greases) from refined petroleum and coal products made in coke ovens not integrated with a steel mill.
example: Biodiesel fuels not made in petroleum refineries and blended with purchased refined petroleum
example: Coke oven products (e.g., coke, gases, tars) made in coke oven establishments
example: Petroleum briquettes made from refined petroleum
example: Petroleum jelly made from refined petroleum
example: Petroleum waxes made from refined petroleum