Other Miscellaneous Manufacturing
type: Class
subclass of: B6jY2IDoS9CpAV1JLKD Bw
definition: This industry group comprises establishments primarily engaged in miscellaneous manufacturing, such as jewelry and silverware manufacturing, sporting and athletic goods manufacturing, doll, toy, and game manufacturing, office supplies (except paper) manufacturing, sign manufacturing, and all other miscellaneous manufacturing.