Support Activities for Printing
type: Class
subclass of: ZRJxhhjYR6GLbt7 -J5bag
definition: This industry comprises establishments primarily engaged in performing prepress and postpress services in support of printing activities. Prepress services may include such things as platemaking, typesetting, trade binding, and sample mounting. Postpress services include such things as book or paper bronzing, die cutting, edging, embossing, folding, gilding, gluing, and indexing.