Agencies, Brokerages, and Other Insurance Related Activities
type: Class
subclass of: RD56727CABa3aB066e948fc1
definition: This industry group comprises establishments primarily engaged in (1) acting as agents (i.e., brokers) in selling annuities and insurance policies or (2) providing other employee benefits and insurance related services, such as claims adjustment and third party administration.