Nonchocolate Confectionery Manufacturing
type: Class
subclass of: a8Zdla40TrWlRz0tXPayfg
definition: This industry comprises establishments primarily engaged in manufacturing nonchocolate confectioneries. Included in this industry are establishments primarily engaged in retailing nonchocolate confectionery products not for immediate consumption made on the premises.