Support Activities for Water Transportation
type: Class
subclass of: 3pmohkTOTG2ocnvB6GoceQ
definition: This industry group comprises establishments primarily engaged in one of the following: (1) operating ports, harbors (including docking and pier facilities), or canals; (2) providing stevedoring and other marine cargo handling services (except warehousing); (3) providing navigational services to shipping; or (4) providing other services to water transportation.