Stationery and Office Supplies Merchant Wholesalers
type: Class
subclass of: Pl75sqrFSeyIkqhDXhay0Q
definition: This industry comprises establishments primarily engaged in the merchant wholesale distribution of stationery, office supplies, and/or gift wrap.
example: Envelopes merchant wholesalers
example: File cards and folders merchant wholesalers
example: Greeting cards merchant wholesalers
example: Office paper (e.g., printer, copier) merchant wholesalers
example: Pencils merchant wholesalers
example: Photocopy supplies merchant wholesalers
example: Social stationery merchant wholesalers
example: Writing pens merchant wholesalers