Pulp, Paper, and Paperboard Mills
type: Class
subclass of: 4yi7CFM6QeKI2AO0lPxrVQ
definition: This industry group comprises establishments primarily engaged in manufacturing pulp, paper, or paperboard.