Other Nonhazardous Waste Treatment and Disposal
type: Class
subclass of: nEU9oAnvS4GKVFPRE4aqrA
definition: This U.S. industry comprises establishments primarily engaged in (1) operating nonhazardous waste treatment and disposal facilities (except landfills, combustors, incinerators, and sewer systems or sewage treatment facilities) or (2) the combined activity of collecting and/or hauling of nonhazardous waste materials within a local area and operating waste treatment or disposal facilities (except landfills, combustors, incinerators, and sewer systems or sewage treatment facilities). Compost dumps are included in this industry.