Confectionery and Nut Retailers
type: Class
subclass of: n2Xua3toTk-SP2X5h4LEPg
definition: This U.S. industry comprises establishments primarily engaged in retailing candy and other confections, nuts, and popcorn not for immediate consumption and not made on the premises.