Other Noncitrus Fruit Farming
type: Class
subclass of: SMxNxWmNRdaY3reO9Yl 2A
definition: This U.S. industry comprises establishments primarily engaged in growing noncitrus fruits (except apples, grapes, berries, and fruit(s) and tree nut(s) combinations).
example: Apricot farming
example: Banana farming
example: Cherry farming
example: Coffee farming
example: Date farming
example: Fig farming
example: Noncitrus fruit farming
example: Peach farming
example: Pineapple farming
example: Prune farming