Navigational, Measuring, Electromedical, and Control Instruments Manufacturing
type: Class
subclass of: Q5vN09qMRwSK5sUS9TrPOA
definition: This industry comprises establishments primarily engaged in manufacturing navigational, measuring, electromedical, and control instruments. Examples of products made by these establishments are aeronautical instruments, appliance regulators and controls (except switches), laboratory analytical instruments, navigation and guidance systems, and physical properties testing equipment.