Mattress Manufacturing
type: Class
subclass of: xD6MyKIjSTKFdr9q1ayrZw
definition: This industry comprises establishments primarily engaged in manufacturing innerspring, box spring, and noninnerspring mattresses.