Beverage Manufacturing
type: Class
subclass of: 8FwY1QS9TE-QSEn2Mk U4g
definition: This industry group comprises establishments primarily engaged in manufacturing soft drinks and ice; purifying and bottling water; and manufacturing brewery, winery, and distillery products.