Drugs and Druggists' Sundries Merchant Wholesalers
type: Class
subclass of: vBLsP p9T0ChTbDgyR8MFw
definition: This industry comprises establishments primarily engaged in the merchant wholesale distribution of biological and medical products; botanical drugs and herbs; and pharmaceutical products intended for internal and/or external consumption in such forms as ampoules, tablets, capsules, vials, ointments, powders, solutions, and suspensions.
example: Antibiotics merchant wholesalers
example: Blood derivatives merchant wholesalers
example: Botanicals merchant wholesalers
example: Cosmetics merchant wholesalers
example: Drugs merchant wholesalers
example: Endocrine substances merchant wholesalers
example: In-vitro and in-vivo diagnostics merchant wholesalers
example: Vaccines merchant wholesalers
example: Veterinarians' medicines merchant wholesalers
example: Vitamins merchant wholesalers