Other Aluminum Rolling, Drawing, and Extruding
type: Class
subclass of: K5US-YUOQA-m1BbwsoarAQ
definition: This U.S. industry comprises establishments primarily engaged in (1) rolling, drawing, or extruding shapes (except flat rolled sheet, plate, foil, and welded tube) from purchased aluminum and/or (2) recovering aluminum from scrap and rolling, drawing, or extruding shapes (except flat rolled sheet, plate, foil, and welded tube) in integrated mills.
example: Aluminum bar made by extruding purchased aluminum
example: Nails, aluminum, made in wire drawing plants
example: Rod made by extruding purchased aluminum
example: Structural shapes made by rolling purchased aluminum
example: Tube made by drawing or extruding purchased aluminum
example: Wire, bare, made in aluminum wire drawing plants