Process, Physical Distribution, and Logistics Consulting Services
type: Class
subclass of: n hXChI-SfOC55gHGN7KqA
definition: This U.S. industry comprises establishments primarily engaged in providing operating advice and assistance to businesses and other organizations in: (1) manufacturing operations improvement; (2) productivity improvement; (3) production planning and control; (4) quality assurance and quality control; (5) inventory management; (6) distribution networks; (7) warehouse use, operations, and utilization; (8) transportation and shipment of goods and materials; and (9) materials management and handling.
example: Freight rate or tariff rate consulting services
example: Inventory planning and control management consulting services
example: Manufacturing management consulting services
example: Productivity improvement consulting services
example: Transportation management consulting services