Manufactured (Mobile) Home Dealers
type: Class
subclass of: FnFj3eBPQmG5yWh1TjghWg
definition: This industry comprises establishments primarily engaged in retailing new and/or used manufactured homes (i.e., mobile homes), parts, and equipment.