Heating Equipment (except Warm Air Furnaces) Manufacturing
type: Class
subclass of: 6TfTE4iQG-6fDQIcaNNZA
definition: This U.S. industry comprises establishments primarily engaged in manufacturing heating equipment (except electric and warm air furnaces), such as heating boilers, heating stoves, floor and wall furnaces, and wall and baseboard heating units.