Commercial Photography
type: Class
subclass of: m8FbcWJvTpmeckLquYexVA
definition: This U.S. industry comprises establishments primarily engaged in providing commercial photography services, generally for advertising agencies, publishers, and other business and industrial users.