Surgical and Medical Instrument Manufacturing
type: Class
subclass of: F0ZuOpBBQameXhSNJBFSaQ
definition: This U.S. industry comprises establishments primarily engaged in manufacturing medical, surgical, ophthalmic, and veterinary instruments and apparatus (except electrotherapeutic, electromedical, and irradiation apparatus). Examples of products made by these establishments are syringes, hypodermic needles, anesthesia apparatus, blood transfusion equipment, catheters, surgical clamps, and medical thermometers.