Book Retailers and News Dealers
type: Class
subclass of: XnB-6x6KQ3i4ACKCepCYmw
definition: This industry comprises establishments primarily engaged in retailing new books, newspapers, magazines, and other periodicals (without publishing).