Confectionery Manufacturing from Purchased Chocolate
type: Class
subclass of: 7zjy747tRHOiMTRBODSXqA
definition: This U.S. industry comprises establishments primarily engaged in manufacturing chocolate confectioneries from chocolate produced elsewhere. Included in this industry are establishments primarily engaged in retailing chocolate confectionery products not for immediate consumption made on the premises from chocolate made elsewhere.