Fitness and Recreational Sports Centers
type: Class
subclass of: MqQx3WSASiOOx-A9ARPHqw
definition: This industry comprises establishments primarily engaged in operating fitness and recreational sports facilities featuring exercise and other active physical fitness conditioning or recreational sports activities, such as swimming, skating, or racquet sports.
example: Aerobic dance or exercise centers
example: Gymnasiums
example: Handball, racquetball, or tennis club facilities
example: Ice or roller skating rinks
example: Physical fitness centers
example: Swimming or wave pools