P600 Completion/Closing
type: Class
subclass of: Rn5kG4YdbRjOyGEVaUvrizw
definition: This phase includes all tasks related to transaction pre-closing and closing, project completion or filing acceptance, such as attendance at closing.