Federal Railroad Administration
type: Class
alternative label: 联邦铁路管理局
subclass of: RC2Ddc09177c7B1338a16e36
hidden label: FRA
definition: The Federal Railroad Administration (FRA) is an agency in the United States Department of Transportation (DOT).