nohiyahoi tobei jumhuri
type: Class
alternative label: TJ+RA
subclass of: R082e9dD322e46D4655735aa
hidden label: TJ+RA
definition: A "nohiyahoi tobei jumhuri" is a subdivision of Tajikistan, which may refer to a district or region within the country.