U.S. Occupational Safety and Health Review Commission
type: Class
preferred label: Occupational Safety and Health Review Commission
alternative label: 美国职业安全与健康审查委员会
subclass of: R22815eC3Af3bFF0d002Ca58
hidden label: OSHRC
definition: The Occupational Safety and Health Review Commission (OSHRC) is an independent federal agency created under the Occupational Safety and Health Act to decide contests of citations or penalties resulting from OSHA inspections of American workplaces.