San Marino
type: Class
alternative label: SM+07
subclass of: RCD644b34Dca88E2613EBce9
hidden label: SM+07
definition: San Marino is a small independent country located within Italy, known for its historic architecture and scenic views.