Baa
type: Class
alternative label: MV+20
subclass of: R45D3d83F1c4603C9903Af83
hidden label: MV+20
definition: Baa refers to a specific administrative division within the Maldives, typically used for political and geographical purposes.