Leningradskaya oblast'
type: Class
alternative label: RU+LEN
subclass of: R53E5e3A8871d86E4f7D1166
hidden label: RU+LEN
definition: Leningradskaya oblast' refers to a region in the Russian Federation.