Southern
type: Class
alternative label: Zambia
alternative label: ZM+07
subclass of: RF18af5C20ab7025b5b3B5da
hidden label: ZM+07
definition: A region in the southern part of Zambia, which is a country in southern Africa.