Komondjari
type: Class
alternative label: BF+KMD
subclass of: R7206beF2A06f0FF256B2d93
hidden label: BF+KMD
definition: Komondjari refers to a region in Burkina Faso, located in the eastern part of the country.