Center for Drug Evaluation and Research
type: Class
alternative label: 药品评价与研究中心
subclass of: R64Be54D494e9DB47be9889c
hidden label: CDER
definition: The Center for Drug Evaluation and Research (CDER) performs an essential public health task by making sure that safe and effective drugs are available to improve the health of people in the United States.