Bankruptcy Claims Practice
type: Class
alternative label: 破产索赔实践
subclass of: R7LI3BONqNkXbKHKa0t3jyI
definition: Bankruptcy Claims Practice refers to the legal work performed by a Legal Services Provider in the course of a bankruptcy matter, specifically related to the filing, objection, and review of claims.