Zacapa
type: Class
alternative label: GT+ZA
subclass of: REE94a4C67f17EFCc9b0E343
hidden label: GT+ZA
definition: Industries in the Textile and Apparel industry group include establishments that make textile products. With a few exceptions, processes used in these industries are generally cut and sew (i.e., purchasing fabric and cutting and sewing to make non-apparel textile products, such as sheets and towels) The industry group includes a diverse range of establishments manufacturing full lines of ready-to-wear apparel and custom apparel: apparel contractors, performing cutting or sewing operations on materials owned by others; jobbers performing entrepreneurial functions involved in apparel manufacture; and tailors, manufacturing custom garments for individual clients are all included. It also includes leather and manufacture.