U.S. Dept. of Justice
type: Class
preferred label: Department of Justice
alternative label: 美国司法部
subclass of: R22815eC3Af3bFF0d002Ca58
hidden label: DOJ
definition: The United States Department of Justice (DOJ), also known as the Justice Department, is a federal executive department of the U.S. government, responsible for the enforcement of the law and administration of justice in the United States, equivalent to the justice or interior ministries of other countries.