Drug Enforcement Administration
type: Class
alternative label: 缉毒局
subclass of: R0DB70442Cf8b73D9275F14a
hidden label: DEA
definition: The Drug Enforcement Administration (DEA) is a United States federal law enforcement agency under the United States Department of Justice, tasked with combating drug smuggling and use within the United States.