Bureau of Safety and Environmental Enforcement
type: Class
alternative label: 安全与环境执法局
subclass of: R5BD36eE92713E8Ce71D3a0d
hidden label: BSEE
definition: The Bureau of Safety and Environmental Enforcement (BSEE) is an agency under the United States Department of the Interior.