Solola
type: Class
alternative label: GT+SO
subclass of: REE94a4C67f17EFCc9b0E343
hidden label: GT+SO
definition: Locations used: Cameroon(CM), Central African Republic(CF), Republic of the Congo(CG), Chad(TD), Equatorial Guinea(GQ), Gabon(GA)