Goods Sold and Delivered
type: Class
alternative label: 已售出并交付的货物
subclass of: R8t5CSqYvG6L6Cl86vQeMRA
definition: Goods Sold and Delivered refers to a legal concept under Sale of Goods where the seller transfers the ownership of goods to the buyer in exchange for payment, and the buyer receives the goods and accepts them as they are.