Future Advances Clause
type: Class
alternative label: 未来进展条款
subclass of: RDe0RKU39BlhcyACJW30ZLc
definition: A Future Advances Clause is a provision in a contract that allows for additional loans or credit to be extended to the borrower in the future, without requiring a new contract or agreement.