Open Book Account
type: Class
alternative label: 公开账户
subclass of: R8jYAnNATrfoBxAtIKpf72X
definition: An open book account is a type of civil claim where a plaintiff seeks payment for goods or services provided to a defendant on an ongoing basis, with the details of the transactions recorded in a book or other record that is open to inspection by both parties.