Consequential Damages Clause
type: Class
alternative label: 连带损害赔偿条款
subclass of: RDe0RKU39BlhcyACJW30ZLc
definition: A Consequential Damages Clause is a provision in a contract that limits the liability of a party for indirect or consequential damages resulting from a breach of the contract.