Asturian; Bable; Leonese; Asturleonese
type: Class
subclass of: RDOvAHsvY8TKJ1O1orXPM9o
definition: Asturian; Bable; Leonese; Asturleonese (Language) is a written or spoken structured system of communication that is specific to the Asturian and Leonese regions of Spain.